Target
D(3) dopamine receptor
Ligand
BDBM50131347
Substrate
Meas. Tech.
ChEMBL_303376 (CHEMBL839694)
Ki
611±n/a nM
Citation
 Andrés, JIAlcázar, JAlonso, JMAlvarez, RMBakker, MHBiesmans, ICid, JMDe Lucas, AIFernández, JFont, LMHens, KAIturrino, LLenaerts, IMartínez, SMegens, AAPastor, JVermote, PCSteckler, T Discovery of a new series of centrally active tricyclic isoxazoles combining serotonin (5-HT) reuptake inhibition with alpha2-adrenoceptor blocking activity. J Med Chem 48:2054-71 (2005)  
Target
Name:
D(3) dopamine receptor
Synonyms:
DOPAMINE D3 DRD3_HUMAN Dopamine D3 receptor (D3) Dopamine receptor Dopamine receptor D3
Type:
Mol. Mass.:
44243.43
Organism:
Homo sapiens (Human)
Description:
Residue:
400
  
Inhibitor
Name:
BDBM50131347
Synonyms:
(3R,3aS)-7,8-Dimethoxy-3-[4-((E)-3-phenyl-but-2-enyl)-piperazin-1-ylmethyl]-3a,4-dihydro-3H-chromeno[4,3-c]isoxazole CHEMBL419316
Type:
Small organic molecule
Emp. Form.:
C27H33N3O4
Mol. Mass.:
463.5686
SMILES:
COc1cc2OC[C@H]3[C@H](CN4CCN(C\C=C(/C)c5ccccc5)CC4)ON=C3c2cc1OC
: