Target
Thyroid hormone receptor alpha/beta
Ligand
BDBM50163888
Substrate
Meas. Tech.
ChEMBL_304369 (CHEMBL829011)
EC50
3±n/a nM
Citation
 Haning, HWoltering, MMueller, USchmidt, GSchmeck, CVoehringer, VKretschmer, APernerstorfer, J Novel heterocyclic thyromimetics. Bioorg Med Chem Lett 15:1835-40 (2005)  
Target
Name:
Thyroid hormone receptor alpha/beta
Synonyms:
Thyroid Hormone Receptor (TR-alpha)/(TR-beta) | Thyroid hormone receptor
Type:
Mol. Mass.:
Description:
ASSAY_ID of EBI is 304338
Components:
This complex has 2 components.
Component 1
Name:
Thyroid hormone receptor alpha
Synonyms:
C-erbA-alpha EAR7 NR1A1 THA_HUMAN THRA1 Thyroid Hormone Receptor (TR-alpha) Thyroid hormone receptor alpha c-erbA-1
Type:
Receptor
Mol. Mass.:
54818.00
Organism:
Homo sapiens (Human)
Description:
Recombinant hThR was obtained from nuclear extracts from SF9 cells infected with baculovirus vectors encoding for ThRalpha 1.
Residue:
490
  
Component 2
Name:
Thyroid hormone receptor beta
Synonyms:
ERBA2 Nuclear receptor subfamily 1 group A member 2 THR1 c-erbA-2 | c-erbA-beta
Type:
Receptor
Mol. Mass.:
52793.62
Organism:
Homo sapiens (Human)
Description:
Recombinant hThR was obtained from nuclear extracts from SF9 cells infected with baculovirus vectors encoding for ThRbeta 1.
Residue:
461
  
Inhibitor
Name:
BDBM50163888
Synonyms:
CHEMBL183176 | N-[4-(3-Isopropyl-1H-indol-5-yloxy)-3,5-bis-trifluoromethyl-phenyl]-oxalamic acid ethyl ester
Type:
Small organic molecule
Emp. Form.:
C23H20F6N2O4
Mol. Mass.:
502.4063
SMILES:
CCOC(=O)C(=O)Nc1cc(c(Oc2ccc3[nH]cc(C(C)C)c3c2)c(c1)C(F)(F)F)C(F)(F)F
: