Target
Protein-glutamine gamma-glutamyltransferase 2
Ligand
BDBM50163964
Substrate
Meas. Tech.
ChEMBL_306222 (CHEMBL831130)
IC50
170±n/a nM
Citation
 Duval, ECase, AStein, RLCuny, GD Structure-activity relationship study of novel tissue transglutaminase inhibitors. Bioorg Med Chem Lett 15:1885-9 (2005)  
Target
Name:
Protein-glutamine gamma-glutamyltransferase 2
Synonyms:
Protein-glutamine gamma-glutamyltransferase TGM2 Tissue transglutaminase Transglutaminase 2 (TGM2) Transglutaminase-2
Type:
Protein
Mol. Mass.:
77309.30
Organism:
Homo sapiens (Human)
Description:
P21980
Residue:
687
  
Inhibitor
Name:
BDBM50163964
Synonyms:
CHEMBL182633 | [3-(3-Fluoro-phenyl)-4-oxo-5-phenyl-3,4,5,6,7,8-hexahydro-benzo[4,5]thieno[2,3-d]pyrimidin-2-ylsulfanyl]-acetic acid hydrazide
Type:
Small organic molecule
Emp. Form.:
C24H21FN4O2S2
Mol. Mass.:
480.578
SMILES:
NNC(=O)CSc1nc2sc3CCCC(c3c2c(=O)n1-c1cccc(F)c1)c1ccccc1
: