Target
Nitric oxide synthase, endothelial
Ligand
BDBM50164776
Substrate
Meas. Tech.
ChEMBL_305499 (CHEMBL831101)
IC50
4500±n/a nM
Citation
 Guthikonda, RNShah, SKPacholok, SGHumes, JLMumford, RAGrant, SKChabin, RMGreen, BGTsou, NBall, RFletcher, DSLuell, SEuan MacIntyre, DMaccoss, M Bicyclic amidine inhibitors of nitric oxide synthase: discovery of perhydro-iminopyrindine and perhydro-iminoquinoline as potent, orally active inhibitors of inducible nitric oxide synthase. Bioorg Med Chem Lett 15:1997-2001 (2005)  
Target
Name:
Nitric oxide synthase, endothelial
Synonyms:
Constitutive NOS Endothelial NOS NOS type III NOS3_HUMAN Nitric oxide synthase (inducible and endothelial) Nitric-oxide synthase (endothelial and brain) eNOS
Type:
Enzyme Catalytic Domain
Mol. Mass.:
133297.84
Organism:
Homo sapiens (Human)
Description:
P29474
Residue:
1203
  
Inhibitor
Name:
BDBM50164776
Synonyms:
(4R,6R,9R)-4-Methyl-decahydro-cyclohepta[b]pyridin-(2E)-ylideneamine | CHEMBL190655
Type:
Small organic molecule
Emp. Form.:
C11H20N2
Mol. Mass.:
180.2899
SMILES:
C[C@@H]1CC(N)=N[C@@H]2CCCCC[C@H]12
: