Target
Nitric oxide synthase, inducible
Ligand
BDBM50164783
Substrate
Meas. Tech.
ChEMBL_305446 (CHEMBL877003)
IC50
528±n/a nM
Citation
 Guthikonda, RNShah, SKPacholok, SGHumes, JLMumford, RAGrant, SKChabin, RMGreen, BGTsou, NBall, RFletcher, DSLuell, SEuan MacIntyre, DMaccoss, M Bicyclic amidine inhibitors of nitric oxide synthase: discovery of perhydro-iminopyrindine and perhydro-iminoquinoline as potent, orally active inhibitors of inducible nitric oxide synthase. Bioorg Med Chem Lett 15:1997-2001 (2005)  
Target
Name:
Nitric oxide synthase, inducible
Synonyms:
HEP-NOS Inducible NO synthase NOS type II NOS2A Nitric oxide synthase, inducible (iNOS) | iNOS
Type:
Homodimer
Mol. Mass.:
131141.95
Organism:
Homo sapiens (Human)
Description:
P35228
Residue:
1153
  
Inhibitor
Name:
BDBM50164783
Synonyms:
(5S,6R)-[Octahydro-quinolin-(2E)-ylidene]amine | CHEMBL193007
Type:
Small organic molecule
Emp. Form.:
C9H16N2
Mol. Mass.:
152.2367
SMILES:
NC1=N[C@H]2CCCC[C@@H]2CC1
: