Target
Nitric oxide synthase, brain
Ligand
BDBM50164777
Substrate
Meas. Tech.
ChEMBL_305408 (CHEMBL833057)
IC50
31.0±n/a nM
Citation
 Guthikonda, RNShah, SKPacholok, SGHumes, JLMumford, RAGrant, SKChabin, RMGreen, BGTsou, NBall, RFletcher, DSLuell, SEuan MacIntyre, DMaccoss, M Bicyclic amidine inhibitors of nitric oxide synthase: discovery of perhydro-iminopyrindine and perhydro-iminoquinoline as potent, orally active inhibitors of inducible nitric oxide synthase. Bioorg Med Chem Lett 15:1997-2001 (2005)  
Target
Name:
Nitric oxide synthase, brain
Synonyms:
Constitutive NOS NC-NOS NOS type I nNOS NOS1_HUMAN Neuronal nitric oxide synthase Nitric oxide synthase, neuronal (nNOS) bNOS | nNOS
Type:
Homodimer
Mol. Mass.:
160985.98
Organism:
Homo sapiens (Human)
Description:
P29475
Residue:
1434
  
Inhibitor
Name:
BDBM50164777
Synonyms:
(4R,4aR,7aR)-4-Methyl-octahydro-[1]pyrindin-(2E)-ylideneamine CHEMBL191242
Type:
Small organic molecule
Emp. Form.:
C9H16N2
Mol. Mass.:
152.2367
SMILES:
C[C@@H]1CC(N)=N[C@@H]2CCC[C@H]12
: