Target
Kinesin-like protein KIF11
Ligand
BDBM24066
Substrate
Meas. Tech.
ChEMBL_306780 (CHEMBL831535)
IC50
450±n/a nM
Citation
 Cox, CDBreslin, MJMariano, BJColeman, PJBuser, CAWalsh, ESHamilton, KHuber, HEKohl, NETorrent, MYan, YKuo, LCHartman, GD Kinesin spindle protein (KSP) inhibitors. Part 1: The discovery of 3,5-diaryl-4,5-dihydropyrazoles as potent and selective inhibitors of the mitotic kinesin KSP. Bioorg Med Chem Lett 15:2041-5 (2005)  
Target
Name:
Kinesin-like protein KIF11
Synonyms:
EG5 KIF11_HUMAN Kinesin Spindle Protein Eg5 TRIP5 | kinesin spindle protein
Type:
PROTEIN
Mol. Mass.:
119138.97
Organism:
Homo sapiens (Human)
Description:
ChEMBL_1457426
Residue:
1056
  
Inhibitor
Name:
BDBM24066
Synonyms:
1-[(5S)-3-(2-chlorophenyl)-5-(3-hydroxyphenyl)-4,5-dihydro-1H-pyrazol-1-yl]ethan-1-one CHEMBL364452
Type:
Small organic molecule
Emp. Form.:
C17H15ClN2O2
Mol. Mass.:
314.766
SMILES:
CC(=O)N1N=C(CC1c1cccc(O)c1)c1ccccc1Cl
: