Target
Cystic fibrosis transmembrane conductance regulator
Ligand
BDBM50165005
Substrate
Meas. Tech.
ChEMBL_310547 (CHEMBL833631)
EC50
11±n/a nM
Citation
 Hirth, BHQiao, SCuff, LMCochran, BMPregel, MJGregory, JSSneddon, SFKane, JL Discovery of 1,2,3,4-tetrahydroisoquinoline-3-carboxylic acid diamides that increase CFTR mediated chloride transport. Bioorg Med Chem Lett 15:2087-91 (2005)  
Target
Name:
Cystic fibrosis transmembrane conductance regulator
Synonyms:
ABCC7 CFTR Channel conductance-controlling ATPase | cAMP-dependent chloride channel
Type:
Enzyme Catalytic Domain
Mol. Mass.:
168171.30
Organism:
Homo sapiens (Human)
Description:
gi_90421313
Residue:
1480
  
Inhibitor
Name:
BDBM50165005
Synonyms:
(S)-2-(2-Isopropoxy-pyridine-4-carbonyl)-1,2,3,4-tetrahydro-isoquinoline-3-carboxylic acid (4-pentyl-phenyl)-amide | CHEMBL191243
Type:
Small organic molecule
Emp. Form.:
C30H35N3O3
Mol. Mass.:
485.6172
SMILES:
CCCCCc1ccc(NC(=O)[C@@H]2Cc3ccccc3CN2C(=O)c2ccnc(OC(C)C)c2)cc1
: