Target
Sodium/hydrogen exchanger 1
Ligand
BDBM50165247
Substrate
Meas. Tech.
ChEMBL_305204 (CHEMBL832458)
IC50
230±n/a nM
Citation
 Lee, SYi, KYHwang, SKLee, BHYoo, SELee, K (5-Arylfuran-2-ylcarbonyl)guanidines as cardioprotectives through the inhibition of Na+/H+ exchanger isoform-1. J Med Chem 48:2882-91 (2005)  
Target
Name:
Sodium/hydrogen exchanger 1
Synonyms:
APNH NHE-1 Na(+)/H(+) antiporter, amiloride-sensitive SL9A1_HUMAN Solute carrier family 9 member 1
Type:
PROTEIN
Mol. Mass.:
90771.96
Organism:
Homo sapiens (Human)
Description:
ChEMBL_862405
Residue:
815
  
Inhibitor
Name:
BDBM50165247
Synonyms:
CHEMBL189789 | N-[5-(5-Fluoro-2-methyl-phenyl)-furan-2-carbonyl]-guanidine
Type:
Small organic molecule
Emp. Form.:
C13H12FN3O2
Mol. Mass.:
261.2517
SMILES:
Cc1ccc(F)cc1-c1ccc(o1)C(=O)NC(N)=N
: