Target
Heat shock protein HSP 90-alpha
Ligand
BDBM50165266
Substrate
Meas. Tech.
ChEMBL_304333 (CHEMBL839760)
EC50
34900±n/a nM
Citation
 Llauger, LHe, HKim, JAguirre, JRosen, NPeters, UDavies, PChiosis, G Evaluation of 8-arylsulfanyl, 8-arylsulfoxyl, and 8-arylsulfonyl adenine derivatives as inhibitors of the heat shock protein 90. J Med Chem 48:2892-905 (2005)  
Target
Name:
Heat shock protein HSP 90-alpha
Synonyms:
HS90A_MOUSE Hsp86-1 Hspca
Type:
PROTEIN
Mol. Mass.:
84750.61
Organism:
Mus musculus
Description:
ChEMBL_304333
Residue:
733
  
Inhibitor
Name:
BDBM50165266
Synonyms:
8-(2-Methoxy-phenylsulfanyl)-9-pent-4-ynyl-9H-purin-6-ylamine | CHEMBL193892
Type:
Small organic molecule
Emp. Form.:
C17H17N5OS
Mol. Mass.:
339.415
SMILES:
COc1ccccc1Sc1nc2c(N)ncnc2n1CCCC#C
: