Target
Heat shock protein HSP 90-alpha
Ligand
BDBM50165281
Substrate
Meas. Tech.
ChEMBL_304333 (CHEMBL839760)
EC50
120±n/a nM
Citation
 Llauger, LHe, HKim, JAguirre, JRosen, NPeters, UDavies, PChiosis, G Evaluation of 8-arylsulfanyl, 8-arylsulfoxyl, and 8-arylsulfonyl adenine derivatives as inhibitors of the heat shock protein 90. J Med Chem 48:2892-905 (2005)  
Target
Name:
Heat shock protein HSP 90-alpha
Synonyms:
HS90A_MOUSE Hsp86-1 Hspca
Type:
PROTEIN
Mol. Mass.:
84750.61
Organism:
Mus musculus
Description:
ChEMBL_304333
Residue:
733
  
Inhibitor
Name:
BDBM50165281
Synonyms:
8-(2-Chloro-3,4,5-trimethoxy-phenylsulfanyl)-2-fluoro-9-pent-4-ynyl-9H-purin-6-ylamine CHEMBL193282 | US10676476, Comp 2
Type:
Small organic molecule
Emp. Form.:
C19H19ClFN5O3S
Mol. Mass.:
451.902
SMILES:
COc1cc(Sc2nc3c(N)nc(F)nc3n2CCCC#C)c(Cl)c(OC)c1OC
: