Target
Alpha-1A adrenergic receptor
Ligand
BDBM50122803
Substrate
Meas. Tech.
ChEMBL_302651 (CHEMBL876691)
Ki
14000±n/a nM
Citation
 Konkel, MJWetzel, JMCahir, MCraig, DANoble, SAGluchowski, C Synthesis and structure-activity relationship of fluoro analogues of 8-{2-[4-(4-methoxyphenyl)piperazin-1yl]ethyl}-8-azaspiro[4.5]decane-7,9-dione as selective alpha(1d)-adrenergic receptor antagonists. J Med Chem 48:3076-9 (2005)  
Target
Name:
Alpha-1A adrenergic receptor
Synonyms:
ADA1A_HUMAN ADRA1C Alpha 1A-adrenoceptor Alpha adrenergic receptor 1a Alpha-adrenergic receptor 1c adrenergic Alpha1 | adrenergic Alpha1C
Type:
Cell-surface receptors
Mol. Mass.:
51511.67
Organism:
Homo sapiens (Human)
Description:
P35348
Residue:
466
  
Inhibitor
Name:
BDBM50122803
Synonyms:
(SNAP-8719)[4-(4-Amino-6,7-dimethoxy-quinazolin-2-yl)-octahydro-quinoxalin-1-yl]-furan-2-yl-methanone 8-{1-Methyl-2-[4-(2,4,5-trifluoro-phenyl)-piperazin-1-yl]-ethyl}-8-aza-spiro[4.5]decane-7,9-dione SNAP-8719
Type:
Small organic molecule
Emp. Form.:
C22H28F3N3O2
Mol. Mass.:
423.4718
SMILES:
C[C@H](CN1CCN(CC1)c1cc(F)c(F)cc1F)N1C(=O)CC2(CCCC2)CC1=O
: