Target
Alpha-1B adrenergic receptor
Ligand
BDBM50143674
Substrate
Meas. Tech.
ChEMBL_302652 (CHEMBL839941)
Ki
67±n/a nM
Citation
 Konkel, MJWetzel, JMCahir, MCraig, DANoble, SAGluchowski, C Synthesis and structure-activity relationship of fluoro analogues of 8-{2-[4-(4-methoxyphenyl)piperazin-1yl]ethyl}-8-azaspiro[4.5]decane-7,9-dione as selective alpha(1d)-adrenergic receptor antagonists. J Med Chem 48:3076-9 (2005)  
Target
Name:
Alpha-1B adrenergic receptor
Synonyms:
ADA1B_HUMAN Adrenergic alpha1B Adrenergic receptor alpha Alpha 1B-adrenoreceptor | Alpha-1B adrenergic receptor
Type:
Enzyme
Mol. Mass.:
56862.13
Organism:
Homo sapiens (Human)
Description:
P35368
Residue:
520
  
Inhibitor
Name:
BDBM50143674
Synonyms:
8-{2-[4-(2-Fluoro-phenyl)-piperazin-1-yl]-ethyl}-8-aza-spiro[4.5]decane-7,9-dione | CHEMBL299691
Type:
Small organic molecule
Emp. Form.:
C21H28FN3O2
Mol. Mass.:
373.4643
SMILES:
Fc1ccccc1N1CCN(CCN2C(=O)CC3(CCCC3)CC2=O)CC1
: