Target
D(3) dopamine receptor
Ligand
BDBM50143661
Substrate
Meas. Tech.
ChEMBL_302448 (CHEMBL827144)
Ki
91±n/a nM
Citation
 Konkel, MJWetzel, JMCahir, MCraig, DANoble, SAGluchowski, C Synthesis and structure-activity relationship of fluoro analogues of 8-{2-[4-(4-methoxyphenyl)piperazin-1yl]ethyl}-8-azaspiro[4.5]decane-7,9-dione as selective alpha(1d)-adrenergic receptor antagonists. J Med Chem 48:3076-9 (2005)  
Target
Name:
D(3) dopamine receptor
Synonyms:
DOPAMINE D3 Dopamine D3 receptor | Drd3
Type:
Protein
Mol. Mass.:
49540.58
Organism:
Rattus norvegicus (Rat)
Description:
P19020
Residue:
446
  
Inhibitor
Name:
BDBM50143661
Synonyms:
8-{2-[4-(4-Fluoro-phenyl)-piperazin-1-yl]-ethyl}-8-aza-spiro[4.5]decane-7,9-dione | CHEMBL57546
Type:
Small organic molecule
Emp. Form.:
C21H28FN3O2
Mol. Mass.:
373.4643
SMILES:
Fc1ccc(cc1)N1CCN(CCN2C(=O)CC3(CCCC3)CC2=O)CC1
: