Target
Cathepsin S
Ligand
BDBM50165426
Substrate
Meas. Tech.
ChEMBL_306629 (CHEMBL829931)
IC50
19±n/a nM
Citation
 Barrett, DGCatalano, JGDeaton, DNLong, STMcFadyen, RBMiller, ABMiller, LRWells-Knecht, KJWright, LL A structural screening approach to ketoamide-based inhibitors of cathepsin K. Bioorg Med Chem Lett 15:2209-13 (2005)  
Target
Name:
Cathepsin S
Synonyms:
CATS_HUMAN Cathepsin S (Cat S) | cathepsin S preproprotein
Type:
Protein
Mol. Mass.:
37507.38
Organism:
Homo sapiens (Human)
Description:
P25774
Residue:
331
  
Inhibitor
Name:
BDBM50165426
Synonyms:
CHEMBL196298 | [(S)-1-((R)-1-Phenyl-ethylaminooxalyl)-pentyl]-carbamic acid bicyclo[2.2.1]hept-2-yl ester
Type:
Small organic molecule
Emp. Form.:
C23H32N2O4
Mol. Mass.:
400.5112
SMILES:
CCCC[C@H](NC(=O)OC1CC2CCC1C2)C(=O)C(=O)N[C@H](C)c1ccccc1
: