Target
Poly [ADP-ribose] polymerase 1
Ligand
BDBM50165478
Substrate
Meas. Tech.
ChEMBL_305621 (CHEMBL829484)
IC50
12±n/a nM
Citation
 Loh, VMCockcroft, XLDillon, KJDixon, LDrzewiecki, JEversley, PJGomez, SHoare, JKerrigan, FMatthews, ITMenear, KAMartin, NMNewton, RFPaul, JSmith, GCVile, JWhittle, AJ Phthalazinones. Part 1: The design and synthesis of a novel series of potent inhibitors of poly(ADP-ribose)polymerase. Bioorg Med Chem Lett 15:2235-8 (2005)  
Target
Name:
Poly [ADP-ribose] polymerase 1
Synonyms:
(ARTD1 or PARP1) 2.4.2.30 ADPRT ARTD1 Human diphtheria toxin-like ADP-ribosyltransferase (ARTD1 or PARP1) NT-PARP-1 PARP1 PPOL Poly [ADP-ribose] polymerase 1 (PARP) Poly [ADP-ribose] polymerase 1 (PARP1) Poly [ADP-ribose] polymerase 1, 28-kDa form Poly [ADP-ribose] polymerase 1, processed C-terminus Poly [ADP-ribose] polymerase-1 Poly(ADP-ribose) polymerase-1 (ARTD1/PARP1) Protein poly-ADP-ribosyltransferase PARP1 | Synonyms=ADPRT
Type:
Mol. Mass.:
113114.22
Organism:
Homo sapiens (Human)
Description:
P09874
Residue:
1014
  
Inhibitor
Name:
BDBM50165478
Synonyms:
1-(3-((4-oxo-3,4-dihydrophthalazin-1-yl)methyl)phenyl)pyrrolidine-2,5-dione CHEMBL195402
Type:
Small organic molecule
Emp. Form.:
C19H15N3O3
Mol. Mass.:
333.3407
SMILES:
Oc1ccc(O)n1-c1cccc(Cc2n[nH]c(=O)c3ccccc23)c1
: