Target
Carbonic anhydrase 1
Ligand
BDBM10881
Substrate
Meas. Tech.
ChEMBL_302305 (CHEMBL827065)
Ki
780±n/a nM
Citation
 Puccetti, LFasolis, GCecchi, AWinum, JYGamberi, AMontero, JLScozzafava, ASupuran, CT Carbonic anhydrase inhibitors: synthesis and inhibition of cytosolic/tumor-associated carbonic anhydrase isozymes I, II, and IX with sulfonamides incorporating thioureido-sulfanilyl scaffolds. Bioorg Med Chem Lett 15:2359-64 (2005)  
Target
Name:
Carbonic anhydrase 1
Synonyms:
CA-I CAB Carbonate dehydratase I Carbonic anhydrase 1 (CA I) Carbonic anhydrase 1 (Recombinant CA I) Carbonic anhydrase B Carbonic anhydrase I (CA I) Carbonic anhydrase I (CAI) Carbonic anhydrase isoenzyme I (hCA I) | hCA
Type:
Enzyme
Mol. Mass.:
28873.37
Organism:
Homo sapiens (Human)
Description:
P00915
Residue:
261
  
Inhibitor
Name:
BDBM10881
Synonyms:
CHEMBL288100 Methazolamide Methazolamide, MZA Sulfonamide, 2 sulfonamide 2
Type:
Small organic molecule
Emp. Form.:
C5H8N4O3S2
Mol. Mass.:
236.272
SMILES:
CC(=O)N=c1sc(nn1C)S(N)(=O)=O
: