Target
cGMP-specific 3',5'-cyclic phosphodiesterase
Ligand
BDBM50165811
Substrate
Meas. Tech.
ChEMBL_304843 (CHEMBL827930)
IC50
34±n/a nM
Citation
 Feixas, JGiovannoni, MPVergelli, CGavaldà, ACesari, NGraziano, ADal Piaz, V New pyrazolo[1',5':1,6]pyrimido[4,5-d]pyridazin-4(3H)-ones as potent and selective PDE5 inhibitors. Bioorg Med Chem Lett 15:2381-4 (2005)  
Target
Name:
cGMP-specific 3',5'-cyclic phosphodiesterase
Synonyms:
3',5'-cyclic phosphodiesterase PDE5 PDE5A_HUMAN Phosphodiesterase 5 (PDE5) Phosphodiesterase 5A (PDE5A) cGMP-specific 3',5'-cyclic phosphodiesterase
Type:
Protein
Mol. Mass.:
99975.83
Organism:
Homo sapiens (Human)
Description:
O76074
Residue:
875
  
Inhibitor
Name:
BDBM50165811
Synonyms:
7-Benzyl-4-sec-butyl-9-methyl-2-phenyl-7H-3,3a,5,7,8-pentaaza-cyclopenta[a]naphthalen-6-one | CHEMBL196241
Type:
Small organic molecule
Emp. Form.:
C26H25N5O
Mol. Mass.:
423.5096
SMILES:
CCC(C)c1nc2c(c(C)nn(Cc3ccccc3)c2=O)c2cc(nn12)-c1ccccc1
: