Target
Mu-type opioid receptor
Ligand
BDBM50068655
Substrate
Meas. Tech.
ChEMBL_303703 (CHEMBL829038)
Ki
167±n/a nM
Citation
 Martinek, TAOtvös, FDervarics, MTóth, GFülöp, F Ligand-based prediction of active conformation by 3D-QSAR flexibility descriptors and their application in 3+3D-QSAR models. J Med Chem 48:3239-50 (2005)  
Target
Name:
Mu-type opioid receptor
Synonyms:
MOR-1 Mu-type opioid receptor (MOR) OPRM_RAT Opioid receptor B Ror-b
Type:
G Protein-Coupled Receptor (GPCR)
Mol. Mass.:
44503.11
Organism:
Rattus norvegicus (rat)
Description:
Competition binding assays were carried out using membrane preparations from transfected HN9.10 cells that constitutively expressed the mu opioid receptor.
Residue:
398
  
Inhibitor
Name:
BDBM50068655
Synonyms:
2-[(S)-2-Amino-3-(4-hydroxy-phenyl)-butyryl]-1,2,3,4-tetrahydro-isoquinoline-3-carboxylic acid [1-(1-carbamoyl-2-phenyl-ethylcarbamoyl)-2-phenyl-ethyl]-amide | CHEMBL365581
Type:
Small organic molecule
Emp. Form.:
C37H39N5O5
Mol. Mass.:
633.7361
SMILES:
N[C@@H](Cc1ccc(O)cc1)C(=O)N1Cc2ccccc2C[C@@H]1C(=O)N[C@@H](Cc1ccccc1)C(=O)N[C@@H](Cc1ccccc1)C(N)=O
: