Target
Adenosine kinase
Ligand
BDBM50090881
Substrate
Meas. Tech.
ChEMBL_304730 (CHEMBL876476)
IC50
1±n/a nM
Citation
 Bookser, BCMatelich, MCOllis, KUgarkar, BG Adenosine kinase inhibitors. 4. 6,8-Disubstituted purine nucleoside derivatives. Synthesis, conformation, and enzyme inhibition. J Med Chem 48:3389-99 (2005)  
Target
Name:
Adenosine kinase
Synonyms:
ADK | ADK_HUMAN
Type:
PROTEIN
Mol. Mass.:
40545.97
Organism:
Homo sapiens (Human)
Description:
ChEMBL_1467841
Residue:
362
  
Inhibitor
Name:
BDBM50090881
Synonyms:
(2R,3R,4S,5R)-2-(6-Bromo-5-phenyl-4-phenylamino-pyrrolo[2,3-d]pyrimidin-7-yl)-5-methyl-tetrahydro-furan-3,4-diol CHEMBL328826
Type:
Small organic molecule
Emp. Form.:
C23H21BrN4O3
Mol. Mass.:
481.342
SMILES:
C[C@H]1O[C@H]([C@H](O)[C@@H]1O)n1c(Br)c(-c2ccccc2)c2c(Nc3ccccc3)ncnc12
: