Target
Adenosine kinase
Ligand
BDBM50166245
Substrate
Meas. Tech.
ChEMBL_304730 (CHEMBL876476)
IC50
500±n/a nM
Citation
 Bookser, BCMatelich, MCOllis, KUgarkar, BG Adenosine kinase inhibitors. 4. 6,8-Disubstituted purine nucleoside derivatives. Synthesis, conformation, and enzyme inhibition. J Med Chem 48:3389-99 (2005)  
Target
Name:
Adenosine kinase
Synonyms:
ADK | ADK_HUMAN
Type:
PROTEIN
Mol. Mass.:
40545.97
Organism:
Homo sapiens (Human)
Description:
ChEMBL_1467841
Residue:
362
  
Inhibitor
Name:
BDBM50166245
Synonyms:
(2R,3R,4S,5R)-2-[6-(2,3-Dihydro-indol-1-yl)-purin-9-yl]-5-hydroxymethyl-tetrahydro-furan-3,4-diol | CHEMBL191760
Type:
Small organic molecule
Emp. Form.:
C18H19N5O4
Mol. Mass.:
369.3746
SMILES:
OC[C@H]1O[C@H]([C@H](O)[C@@H]1O)n1cnc2c(ncnc12)N1CCc2ccccc12
: