Target
Metabotropic glutamate receptor 2
Ligand
BDBM50056272
Substrate
Meas. Tech.
ChEMBL_303520 (CHEMBL839634)
Ki
74.0±n/a nM
Citation
 Dominguez, CPrieto, LValli, MJMassey, SMBures, MWright, RAJohnson, BGAndis, SLKingston, ASchoepp, DDMonn, JA Methyl substitution of 2-aminobicyclo[3.1.0]hexane 2,6-dicarboxylate (LY354740) determines functional activity at metabotropic glutamate receptors: identification of a subtype selective mGlu2 receptor agonist. J Med Chem 48:3605-12 (2005)  
Target
Name:
Metabotropic glutamate receptor 2
Synonyms:
GPRC1B GRM2_HUMAN Metabotropic glutamate receptor mGlu2 | metabotropic glutamate 2
Type:
Enzyme
Mol. Mass.:
95584.88
Organism:
Homo sapiens (Human)
Description:
Q14416
Residue:
872
  
Inhibitor
Name:
BDBM50056272
Synonyms:
(1S,2S,5R,6S)-2-Amino-bicyclo[3.1.0]hexane-2,6-dicarboxylic acid (2S,6S)-2-Amino-bicyclo[3.1.0]hexane-2,6-dicarboxylic acid 2-Amino-bicyclo[3.1.0]hexane-2,6-dicarboxylic acid (LY 354740) CHEMBL8759 LY366563
Type:
Small organic molecule
Emp. Form.:
C8H11NO4
Mol. Mass.:
185.1772
SMILES:
N[C@]1(CC[C@H]2[C@@H]([C@@H]12)C(O)=O)C(O)=O
: