Target
Cathepsin K
Ligand
BDBM50167305
Substrate
Meas. Tech.
ChEMBL_303352 (CHEMBL839667)
Ki
62±n/a nM
Citation
 Barrett, DGDeaton, DNHassell, AMMcFadyen, RBMiller, ABMiller, LRPayne, JAShewchuk, LMWillard, DHWright, LL Acyclic cyanamide-based inhibitors of cathepsin K. Bioorg Med Chem Lett 15:3039-43 (2005)  
Target
Name:
Cathepsin K
Synonyms:
CATK_HUMAN CTSO Cathepsin O Cathepsin X
Type:
Enzyme
Mol. Mass.:
36975.68
Organism:
Homo sapiens (Human)
Description:
P43235
Residue:
329
  
Inhibitor
Name:
BDBM50167305
Synonyms:
(1S)-2-cyclohexyl-1-methylethyl 2-cyano-1,2-dimethylhydrazinecarboxylate | CHEMBL362925
Type:
Small organic molecule
Emp. Form.:
C13H23N3O2
Mol. Mass.:
253.3406
SMILES:
C[C@@H](CC1CCCCC1)OC(=O)N(C)N(C)C#N
: