Target
Replicase polyprotein 1a
Ligand
BDBM50167309
Substrate
Meas. Tech.
ChEMBL_305605 (CHEMBL828143)
IC50
980±n/a nM
Citation
 Chen, LRWang, YCLin, YWChou, SYChen, SFLiu, LTWu, YTKuo, CJChen, TSJuang, SH Synthesis and evaluation of isatin derivatives as effective SARS coronavirus 3CL protease inhibitors. Bioorg Med Chem Lett 15:3058-62 (2005)  
Target
Name:
Replicase polyprotein 1a
Synonyms:
3C-like proteinase 3CLp Growth factor-like peptide Non-structural protein 1 Non-structural protein 11 Non-structural protein 3 Non-structural protein 6 Non-structural protein 8 ORF1a polyprotein PL2-PRO Papain-like proteinase Replicase polyprotein 1a SARS coronavirus 3C-like proteinase nsp1 nsp11 nsp3 nsp5 nsp7 nsp9 pp1a
Type:
Enzyme
Mol. Mass.:
486353.36
Organism:
Human SARS coronavirus (SARS-CoV)
Description:
P0C6U8
Residue:
4382
  
Inhibitor
Name:
BDBM50167309
Synonyms:
1-Benzo[b]thiophen-2-ylmethyl-7-bromo-1H-indole-2,3-dione acs.jmedchem.1c00409_ST.236 | med.21724, Compound 107
Type:
Small organic molecule
Emp. Form.:
C17H10BrNO2S
Mol. Mass.:
372.236
SMILES:
Brc1cccc2C(=O)C(=O)N(Cc3cc4ccccc4s3)c12
: