Target
Matrix metalloproteinase-9
Ligand
BDBM50167489
Substrate
Meas. Tech.
ChEMBL_302347 (CHEMBL875196)
Ki
>2130±n/a nM
Citation
 Duan, JJLu, ZWasserman, ZRLiu, RQCovington, MBDecicco, CP Non-hydroxamate 5-phenylpyrimidine-2,4,6-trione derivatives as selective inhibitors of tumor necrosis factor-alpha converting enzyme. Bioorg Med Chem Lett 15:2970-3 (2005)  
Target
Name:
Matrix metalloproteinase-9
Synonyms:
67 kDa matrix metalloproteinase-9 92 kDa gelatinase CLG4B Gelatinase B MMP9 Matrix metalloproteinase 9 (MMP-9) Matrix metalloproteinase-9 (MMP9)
Type:
Enzyme
Mol. Mass.:
78452.28
Organism:
Homo sapiens (Human)
Description:
P14780
Residue:
707
  
Inhibitor
Name:
BDBM50167489
Synonyms:
5-(4-Benzyloxy-phenyl)-5-methyl-pyrimidine-2,4,6-trione | CHEMBL373311
Type:
Small organic molecule
Emp. Form.:
C18H16N2O4
Mol. Mass.:
324.3306
SMILES:
CC1(C(=O)NC(=O)NC1=O)c1ccc(OCc2ccccc2)cc1
: