Target
Collagenase 3
Ligand
BDBM50167489
Substrate
Meas. Tech.
ChEMBL_302358 (CHEMBL828077)
Ki
4020±n/a nM
Citation
 Duan, JJLu, ZWasserman, ZRLiu, RQCovington, MBDecicco, CP Non-hydroxamate 5-phenylpyrimidine-2,4,6-trione derivatives as selective inhibitors of tumor necrosis factor-alpha converting enzyme. Bioorg Med Chem Lett 15:2970-3 (2005)  
Target
Name:
Collagenase 3
Synonyms:
MMP-13 MMP13_HUMAN Matrix metalloproteinase-13 (MMP-13) | Matrix metalloproteinase-13 (MMP13)
Type:
Enzyme
Mol. Mass.:
53808.06
Organism:
Homo sapiens (Human)
Description:
P45452
Residue:
471
  
Inhibitor
Name:
BDBM50167489
Synonyms:
5-(4-Benzyloxy-phenyl)-5-methyl-pyrimidine-2,4,6-trione | CHEMBL373311
Type:
Small organic molecule
Emp. Form.:
C18H16N2O4
Mol. Mass.:
324.3306
SMILES:
CC1(C(=O)NC(=O)NC1=O)c1ccc(OCc2ccccc2)cc1
: