Target
Nitric oxide synthase, brain
Ligand
BDBM50167729
Substrate
Meas. Tech.
ChEMBL_305620 (CHEMBL829483)
IC50
3500±n/a nM
Citation
 Ijuin, RUmezawa, NNagai, SHiguchi, T Evaluation of 3-substituted arginine analogs as selective inhibitors of human nitric oxide synthase isozymes. Bioorg Med Chem Lett 15:2881-5 (2005)  
Target
Name:
Nitric oxide synthase, brain
Synonyms:
Constitutive NOS NC-NOS NOS type I nNOS NOS1_HUMAN Neuronal nitric oxide synthase Nitric oxide synthase, neuronal (nNOS) bNOS | nNOS
Type:
Homodimer
Mol. Mass.:
160985.98
Organism:
Homo sapiens (Human)
Description:
P29475
Residue:
1434
  
Inhibitor
Name:
BDBM50167729
Synonyms:
(S)-2-(S)-Amino-3-methyl-5-(2-methyl-isothioureido)-pentanoic acid tert-butyl ester | CHEMBL193967
Type:
Small organic molecule
Emp. Form.:
C12H25N3O2S
Mol. Mass.:
275.411
SMILES:
CSC(=N)NCC[C@H](C)[C@H](N)C(=O)OC(C)(C)C
: