Target
Nitric oxide synthase, inducible
Ligand
BDBM50167729
Substrate
Meas. Tech.
ChEMBL_305648 (CHEMBL829506)
IC50
4500±n/a nM
Citation
 Ijuin, RUmezawa, NNagai, SHiguchi, T Evaluation of 3-substituted arginine analogs as selective inhibitors of human nitric oxide synthase isozymes. Bioorg Med Chem Lett 15:2881-5 (2005)  
Target
Name:
Nitric oxide synthase, inducible
Synonyms:
HEP-NOS Inducible NO synthase NOS type II NOS2A Nitric oxide synthase, inducible (iNOS) | iNOS
Type:
Homodimer
Mol. Mass.:
131141.95
Organism:
Homo sapiens (Human)
Description:
P35228
Residue:
1153
  
Inhibitor
Name:
BDBM50167729
Synonyms:
(S)-2-(S)-Amino-3-methyl-5-(2-methyl-isothioureido)-pentanoic acid tert-butyl ester | CHEMBL193967
Type:
Small organic molecule
Emp. Form.:
C12H25N3O2S
Mol. Mass.:
275.411
SMILES:
CSC(=N)NCC[C@H](C)[C@H](N)C(=O)OC(C)(C)C
: