Target
Coagulation factor VII
Ligand
BDBM50167837
Substrate
Meas. Tech.
ChEMBL_304953 (CHEMBL827832)
IC50
1.7±n/a nM
Citation
 Schweitzer, BANeumann, WLRahman, HKKusturin, CLSample, KRPoda, GIKurumbail, RGStevens, AMStegeman, RAStallings, WCSouth, MS Structure-based design and synthesis of pyrazinones containing novel P1 'side pocket' moieties as inhibitors of TF/VIIa. Bioorg Med Chem Lett 15:3006-11 (2005)  
Target
Name:
Coagulation factor VII
Synonyms:
Eptacog alfa FA7_HUMAN Factor VIIa (fVIIa) SPCA serum prothrombin conversion accelerator
Type:
Enzyme
Mol. Mass.:
51599.89
Organism:
Homo sapiens (Human)
Description:
Residue:
466
  
Inhibitor
Name:
BDBM50167837
Synonyms:
3-Amino-N-((R)-sec-butyl)-5-{1-[(4-carbamimidoyl-benzylcarbamoyl)-methyl]-5-isopropylamino-6-oxo-1,6-dihydro-pyrazin-2-yl}-benzamide | CHEMBL192738
Type:
Small organic molecule
Emp. Form.:
C28H36N8O3
Mol. Mass.:
532.6372
SMILES:
CC[C@@H](C)NC(=O)c1cc(N)cc(c1)-c1cnc(NC(C)C)c(=O)n1CC(=O)NCc1ccc(cc1)C(N)=N
: