Target
Gonadotropin-releasing hormone receptor
Ligand
BDBM50168700
Substrate
Meas. Tech.
ChEMBL_303748 (CHEMBL829791)
Ki
3±n/a nM
Citation
 Guo, ZWu, DZhu, YFTucci, FCRegan, CFRowbottom, MWStruthers, RSXie, QReijmers, SSullivan, SKSai, YChen, C Structure-activity relationships of 1,3,5-triazine-2,4,6-triones as human gonadotropin-releasing hormone receptor antagonists. Bioorg Med Chem Lett 15:3685-90 (2005)  
Target
Name:
Gonadotropin-releasing hormone receptor
Synonyms:
GNRHR GRHR GnRH-R Gonadotropin-releasing hormone receptor | Gonadotropin-releasing hormone receptor (GnRH)
Type:
Enzyme
Mol. Mass.:
37749.45
Organism:
Homo sapiens (Human)
Description:
P30968
Residue:
328
  
Inhibitor
Name:
BDBM50168700
Synonyms:
1-((R)-2-Amino-2-phenyl-ethyl)-3-(2-fluoro-3-methoxy-phenyl)-5-(2-fluoro-6-trifluoromethyl-benzyl)-[1,3,5]triazinane-2,4,6-trione | CHEMBL175711
Type:
Small organic molecule
Emp. Form.:
C26H21F5N4O4
Mol. Mass.:
548.4614
SMILES:
COc1cccc(c1F)-n1c(=O)n(C[C@H](N)c2ccccc2)c(=O)n(Cc2c(F)cccc2C(F)(F)F)c1=O
: