Target
Prostaglandin E synthase 2
Ligand
BDBM50168778
Substrate
Meas. Tech.
ChEMBL_305014 (CHEMBL829449)
IC50
6700±n/a nM
Citation
 Riendeau, DAspiotis, REthier, DGareau, YGrimm, ELGuay, JGuiral, SJuteau, HMancini, JAMéthot, NRubin, JFriesen, RW Inhibitors of the inducible microsomal prostaglandin E2 synthase (mPGES-1) derived from MK-886. Bioorg Med Chem Lett 15:3352-5 (2005)  
Target
Name:
Prostaglandin E synthase 2
Synonyms:
C9orf15 PGES2_HUMAN | PTGES2
Type:
Enzyme
Mol. Mass.:
41955.21
Organism:
Homo sapiens (Human)
Description:
Q9H7Z7
Residue:
377
  
Inhibitor
Name:
BDBM50168778
Synonyms:
3-(1-Allyl-3-tert-butylsulfanyl-5-isopropyl-1H-indol-2-yl)-2,2-dimethyl-propionic acid | CHEMBL181986
Type:
Small organic molecule
Emp. Form.:
C23H33NO2S
Mol. Mass.:
387.579
SMILES:
CC(C)c1ccc2n(CC=C)c(CC(C)(C)C(O)=O)c(SC(C)(C)C)c2c1
: