Target
Ribosomal protein S6 kinase alpha-5
Ligand
BDBM50168577
Substrate
Meas. Tech.
ChEMBL_304566 (CHEMBL877123)
IC50
1.5±n/a nM
Citation
 Bamford, MJBailey, NDavies, SDean, DKFrancis, LPanchal, TAParr, CASehmi, SSteadman, JGTakle, AKTownsend, JTWilson, DM (1H-imidazo[4,5-c]pyridin-2-yl)-1,2,5-oxadiazol-3-ylamine derivatives: further optimisation as highly potent and selective MSK-1-inhibitors. Bioorg Med Chem Lett 15:3407-11 (2005)  
Target
Name:
Ribosomal protein S6 kinase alpha-5
Synonyms:
90 kDa ribosomal protein S6 kinase 5 MSK1 Nuclear mitogen- and stress-activated protein kinase 1 RPS6KA5 RSK-like protein kinase Ribosomal protein S6 kinase Ribosomal protein S6 kinase alpha-5
Type:
Serine/threonine-protein kinase
Mol. Mass.:
89874.44
Organism:
Homo sapiens (Human)
Description:
Residue:
802
  
Inhibitor
Name:
BDBM50168577
Synonyms:
4-(1-Cyclopropyl-1H-imidazo[4,5-c]pyridin-2-yl)-furazan-3-ylamine | CHEMBL185962
Type:
Small organic molecule
Emp. Form.:
C11H10N6O
Mol. Mass.:
242.2367
SMILES:
Nc1nonc1-c1nc2cnccc2n1C1CC1
: