Target
alpha-1,2-Mannosidase
Ligand
BDBM50169000
Substrate
Meas. Tech.
ChEMBL_300011 (CHEMBL852059)
IC50
58000±n/a nM
Citation
 Fiaux, HPopowycz, FFavre, SSchütz, CVogel, PGerber-Lemaire, SJuillerat-Jeanneret, L Functionalized pyrrolidines inhibit alpha-mannosidase activity and growth of human glioblastoma and melanoma cells. J Med Chem 48:4237-46 (2005)  
Target
Name:
alpha-1,2-Mannosidase
Synonyms:
Alpha-mannosidase
Type:
PROTEIN
Mol. Mass.:
65344.50
Organism:
Glycine max
Description:
ChEMBL_32380
Residue:
578
  
Inhibitor
Name:
BDBM50169000
Synonyms:
(2R,3R,4S)-2-[((R)-2-Benzyloxy-1-phenyl-ethylamino)-methyl]-pyrrolidine-3,4-diol | CHEMBL363665
Type:
Small organic molecule
Emp. Form.:
C20H26N2O3
Mol. Mass.:
342.432
SMILES:
O[C@H]1CN[C@H](CNC(COCc2ccccc2)c2ccccc2)[C@H]1O
: