Target
Plasmepsin I
Ligand
BDBM50169110
Substrate
Meas. Tech.
ChEMBL_302875 (CHEMBL828789)
Ki
1.9±n/a nM
Citation
 Johansson, POLindberg, JBlackman, MJKvarnström, IVrang, LHamelink, EHallberg, ARosenquist, ASamuelsson, B Design and synthesis of potent inhibitors of plasmepsin I and II: X-ray crystal structure of inhibitor in complex with plasmepsin II. J Med Chem 48:4400-9 (2005)  
Target
Name:
Plasmepsin I
Synonyms:
PFAPG PMI Plasmepsin-1 precursor
Type:
Enzyme
Mol. Mass.:
51463.30
Organism:
Plasmodium falciparum
Description:
Residue:
452
  
Inhibitor
Name:
BDBM50169110
Synonyms:
CHEMBL364630 | Pyridine-2-carboxylic acid {(S)-1-[(1S,2S)-1-(biphenyl-4-ylmethoxymethyl)-3-butylcarbamoyl-2-hydroxy-propylcarbamoyl]-2-methyl-propyl}-amide
Type:
Small organic molecule
Emp. Form.:
C33H42N4O5
Mol. Mass.:
574.7104
SMILES:
CCCCNC(=O)C[C@H](O)[C@H](COCc1ccc(cc1)-c1ccccc1)NC(=O)[C@@H](NC(=O)c1ccccn1)C(C)C
: