Target
Melanocortin receptor 4
Ligand
BDBM50169442
Substrate
Meas. Tech.
ChEMBL_310315 (CHEMBL833271)
EC50
6000±n/a nM
Citation
 Ye, ZGuo, LBarakat, KJPollard, PGPalucki, BLSebhat, IKBakshi, RKTang, RKalyani, RNVongs, AChen, ASChen, HYRosenblum, CIMacNeil, TWeinberg, DHPeng, QTamvakopoulos, CMiller, RRStearns, RACashen, DEMartin, WJMetzger, JMStrack, AMMacIntyre, DEVan der Ploeg, LHPatchett, AAWyvratt, MJNargund, RP Discovery and activity of (1R,4S,6R)-N-[(1R)-2-[4-cyclohexyl-4-[[(1,1-dimethylethyl)amino]carbonyl]-1-piperidinyl]-1-[(4-fluorophenyl)methyl]-2-oxoethyl]-2-methyl-2-azabicyclo[2.2.2]octane-6-carboxamide (3, RY764), a potent and selective melanocortin subtype-4 receptor agonist. Bioorg Med Chem Lett 15:3501-5 (2005)  
Target
Name:
Melanocortin receptor 4
Synonyms:
MC4-R Mc4r
Type:
PROTEIN
Mol. Mass.:
36964.43
Organism:
Mus musculus
Description:
ChEMBL_1498850
Residue:
332
  
Inhibitor
Name:
BDBM50169442
Synonyms:
(1R,4S,6R)-2-Methyl-2-aza-bicyclo[2.2.2]octane-6-carboxylic acid [(R)-2-(4-tert-butylcarbamoyl-4-cyclohexyl-piperidin-1-yl)-1-(4-fluoro-benzyl)-2-oxo-ethyl]-amide | CHEMBL364346
Type:
Small organic molecule
Emp. Form.:
C34H51FN4O3
Mol. Mass.:
582.7921
SMILES:
CN1C[C@H]2CC[C@@H]1[C@@H](C2)C(=O)N[C@H](Cc1ccc(F)cc1)C(=O)N1CCC(CC1)(C1CCCCC1)C(=O)NC(C)(C)C
: