Target
Cathepsin S
Ligand
BDBM50169481
Substrate
Meas. Tech.
ChEMBL_306593 (CHEMBL832940)
IC50
3700±n/a nM
Citation
 Barrett, DGBoncek, VMCatalano, JGDeaton, DNHassell, AMJurgensen, CHLong, STMcFadyen, RBMiller, ABMiller, LRPayne, JARay, JASamano, VShewchuk, LMTavares, FXWells-Knecht, KJWillard, DHWright, LLZhou, HQ P2-P3 conformationally constrained ketoamide-based inhibitors of cathepsin K. Bioorg Med Chem Lett 15:3540-6 (2005)  
Target
Name:
Cathepsin S
Synonyms:
CATS_HUMAN Cathepsin S (Cat S) | cathepsin S preproprotein
Type:
Protein
Mol. Mass.:
37507.38
Organism:
Homo sapiens (Human)
Description:
P25774
Residue:
331
  
Inhibitor
Name:
BDBM50169481
Synonyms:
CHEMBL189604 | [(S)-1-(1-Phenyl-ethylaminooxalyl)-pentyl]-carbamic acid (R)-2-methyl-1-(5-phenyl-[1,3,4]oxadiazol-2-ylmethyl)-propyl ester
Type:
Small organic molecule
Emp. Form.:
C29H36N4O5
Mol. Mass.:
520.6199
SMILES:
CCCC[C@H](NC(=O)O[C@H](Cc1nnc(o1)-c1ccccc1)C(C)C)C(=O)C(=O)N[C@H](C)c1ccccc1
: