Target
Cathepsin B
Ligand
BDBM19783
Substrate
Meas. Tech.
ChEMBL_306559 (CHEMBL829134)
IC50
20000±n/a nM
Citation
 Barrett, DGBoncek, VMCatalano, JGDeaton, DNHassell, AMJurgensen, CHLong, STMcFadyen, RBMiller, ABMiller, LRPayne, JARay, JASamano, VShewchuk, LMTavares, FXWells-Knecht, KJWillard, DHWright, LLZhou, HQ P2-P3 conformationally constrained ketoamide-based inhibitors of cathepsin K. Bioorg Med Chem Lett 15:3540-6 (2005)  
Target
Name:
Cathepsin B
Synonyms:
APP secretase CATB_HUMAN CTSB Cathepsin B light chain | Cathepsin B1
Type:
Enzyme
Mol. Mass.:
37819.69
Organism:
Homo sapiens (Human)
Description:
gi_63102437
Residue:
339
  
Inhibitor
Name:
BDBM19783
Synonyms:
(2S)-3,3-dimethyl-1-{3-[4-(trifluoromethyl)phenyl]-1H-pyrazol-1-yl}butan-2-yl N-[(2S)-1-oxo-1-(1H-pyrazol-5-ylcarbamoyl)hexan-2-yl]carbamate ketoamide, 2
Type:
Small organic molecule
Emp. Form.:
C27H33F3N6O4
Mol. Mass.:
562.5839
SMILES:
CCCC[C@H](NC(=O)O[C@H](Cn1ccc(n1)-c1ccc(cc1)C(F)(F)F)C(C)(C)C)C(=O)C(=O)Nc1ccn[nH]1
: