Target
Transient receptor potential cation channel subfamily V member 1
Ligand
BDBM50170250
Substrate
Meas. Tech.
ChEMBL_302711 (CHEMBL839583)
Ki
9560.0±n/a nM
Citation
 Lee, JKang, SUKil, MJShin, MLim, JOChoi, HKJin, MKKim, SYKim, SELee, YSMin, KHKim, YHHa, HJTran, RWelter, JDWang, YSzabo, TPearce, LVLundberg, DJToth, APavlyukovets, VAMorgan, MABlumberg, PM Analysis of structure-activity relationships for the 'A-region' of N-(4-t-butylbenzyl)-N'-[4-(methylsulfonylamino)benzyl]thiourea analogues as TRPV1 antagonists. Bioorg Med Chem Lett 15:4136-42 (2005)  
Target
Name:
Transient receptor potential cation channel subfamily V member 1
Synonyms:
Capsaicin receptor TRPV1_RAT Trpv1 Vanilloid VR1 Vanilloid receptor 1 (VRI/TRPV1) Vanilloid receptor type 1-like (TrpV1/Vr1) Vr1l | osm-9-like TRP channel 1
Type:
Transient Receptor
Mol. Mass.:
94956.12
Organism:
Rattus norvegicus (rat)
Description:
O35433
Residue:
838
  
Inhibitor
Name:
BDBM50170250
Synonyms:
CHEMBL189640 | N-{4-[3-(4-tert-Butyl-benzyl)-thioureido]-phenyl}-methanesulfonamide
Type:
Small organic molecule
Emp. Form.:
C19H25N3O2S2
Mol. Mass.:
391.551
SMILES:
CC(C)(C)c1ccc(CNC(=S)Nc2ccc(NS(C)(=O)=O)cc2)cc1
: