Target
Nitric oxide synthase, endothelial
Ligand
BDBM50115162
Substrate
Meas. Tech.
ChEMBL_306644 (CHEMBL832981)
IC50
14710±n/a nM
Citation
 Matter, HKumar, HSFedorov, RFrey, AKotsonis, PHartmann, EFröhlich, LGReif, APfleiderer, WScheurer, PGhosh, DKSchlichting, ISchmidt, HH Structural analysis of isoform-specific inhibitors targeting the tetrahydrobiopterin binding site of human nitric oxide synthases. J Med Chem 48:4783-92 (2005)  
Target
Name:
Nitric oxide synthase, endothelial
Synonyms:
Constitutive NOS Endothelial NOS NOS type III NOS3_HUMAN Nitric oxide synthase (inducible and endothelial) Nitric-oxide synthase (endothelial and brain) eNOS
Type:
Enzyme Catalytic Domain
Mol. Mass.:
133297.84
Organism:
Homo sapiens (Human)
Description:
P29474
Residue:
1203
  
Inhibitor
Name:
BDBM50115162
Synonyms:
6-(4-Chloro-phenyl)-4-piperidin-1-yl-5,6,7,8-tetrahydro-pteridin-2-ylamine | CHEMBL101879
Type:
Small organic molecule
Emp. Form.:
C17H21ClN6
Mol. Mass.:
344.842
SMILES:
Nc1nc2NCC(Nc2c(n1)N1CCCCC1)c1ccc(Cl)cc1
: