Target
Cholecystokinin receptor type A
Ligand
BDBM50060322
Substrate
Meas. Tech.
ChEMBL_306877 (CHEMBL828683)
IC50
20860±n/a nM
Citation
 Martín-Martínez, MMarty, AJourdan, MEscrieut, CArcher, EGonzález-Muñiz, RGarcía-López, MTMaigret, BHerranz, RFourmy, D Combination of molecular modeling, site-directed mutagenesis, and SAR studies to delineate the binding site of pyridopyrimidine antagonists on the human CCK1 receptor. J Med Chem 48:4842-50 (2005)  
Target
Name:
Cholecystokinin receptor type A
Synonyms:
CCK-A receptor CCK1-R CCKAR_HUMAN Cholecystokinin receptor Cholecystokinin-1 Receptor
Type:
G Protein-Coupled Receptor (GPCR)
Mol. Mass.:
47859.34
Organism:
Homo sapiens (Human)
Description:
Stable expression of human CCK-1 receptors in HEK 293 cells.
Residue:
428
  
Inhibitor
Name:
BDBM50060322
Synonyms:
CHEMBL332261 | [(S)-1-((4aS,5S)-2-Benzyl-1,3-dioxo-octahydro-pyrido[1,2-c]pyrimidin-5-ylcarbamoyl)-2-(1H-indol-3-yl)-ethyl]-carbamic acid tert-butyl ester
Type:
Small organic molecule
Emp. Form.:
C31H37N5O5
Mol. Mass.:
559.656
SMILES:
CC(C)(C)OC(=O)N[C@@H](Cc1c[nH]c2ccccc12)C(=O)N[C@H]1CCCN2[C@H]1CC(=O)N(Cc1ccccc1)C2=O
: