Target
Cholecystokinin receptor type A
Ligand
BDBM50170764
Substrate
Meas. Tech.
ChEMBL_306880 (CHEMBL828686)
IC50
0.590±n/a nM
Citation
 Martín-Martínez, MMarty, AJourdan, MEscrieut, CArcher, EGonzález-Muñiz, RGarcía-López, MTMaigret, BHerranz, RFourmy, D Combination of molecular modeling, site-directed mutagenesis, and SAR studies to delineate the binding site of pyridopyrimidine antagonists on the human CCK1 receptor. J Med Chem 48:4842-50 (2005)  
Target
Name:
Cholecystokinin receptor type A
Synonyms:
CCKAR_RAT Cholecystokinin peripheral Cholecystokinin receptor type A
Type:
Enzyme Catalytic Domain
Mol. Mass.:
49676.37
Organism:
RAT
Description:
Cholecystokinin central 0 RAT::P30551
Residue:
444
  
Inhibitor
Name:
BDBM50170764
Synonyms:
CHEMBL366344 | [(S)-2-(1H-Indol-3-yl)-1-((4aS,5R)-2-naphthalen-1-yl-1,3-dioxo-octahydro-pyrido[1,2-c]pyrimidin-5-ylcarbamoyl)-ethyl]-carbamic acid tert-butyl ester
Type:
Small organic molecule
Emp. Form.:
C34H37N5O5
Mol. Mass.:
595.6881
SMILES:
CC(C)(C)OC(=O)N[C@@H](Cc1c[nH]c2ccccc12)C(=O)N[C@@H]1CCCN2[C@H]1CC(=O)N(C2=O)c1cccc2ccccc12
: