Target
Gastrin/cholecystokinin type B receptor
Ligand
BDBM50060319
Substrate
Meas. Tech.
ChEMBL_306879 (CHEMBL828685)
IC50
>10000±n/a nM
Citation
 Martín-Martínez, MMarty, AJourdan, MEscrieut, CArcher, EGonzález-Muñiz, RGarcía-López, MTMaigret, BHerranz, RFourmy, D Combination of molecular modeling, site-directed mutagenesis, and SAR studies to delineate the binding site of pyridopyrimidine antagonists on the human CCK1 receptor. J Med Chem 48:4842-50 (2005)  
Target
Name:
Gastrin/cholecystokinin type B receptor
Synonyms:
Cckbr Cholecystokinin B receptor GASR_RAT | Gastrin/cholecystokinin type B receptor
Type:
Enzyme Catalytic Domain
Mol. Mass.:
48980.43
Organism:
RAT
Description:
Cholecystokinin A CCKBR RAT::P30553
Residue:
452
  
Inhibitor
Name:
BDBM50060319
Synonyms:
CHEMBL113718 | [(S)-1-((4aS,5R)-2-Benzyl-1,3-dioxo-octahydro-pyrido[1,2-c]pyrimidin-5-ylcarbamoyl)-2-(1H-indol-3-yl)-ethyl]-carbamic acid tert-butyl ester
Type:
Small organic molecule
Emp. Form.:
C31H37N5O5
Mol. Mass.:
559.656
SMILES:
CC(C)(C)OC(=O)N[C@@H](Cc1c[nH]c2ccccc12)C(=O)N[C@@H]1CCCN2[C@H]1CC(=O)N(Cc1ccccc1)C2=O
: