Target
Adenosine receptor A3
Ligand
BDBM50170823
Substrate
Meas. Tech.
ChEMBL_303319 (CHEMBL840044)
Ki
70.0±n/a nM
Citation
 Perreira, MJiang, JKKlutz, AMGao, ZGShainberg, ALu, CThomas, CJJacobson, KA "Reversine" and its 2-substituted adenine derivatives as potent and selective A3 adenosine receptor antagonists. J Med Chem 48:4910-8 (2005)  
Target
Name:
Adenosine receptor A3
Synonyms:
A3 adenosine receptor (hA3) ADORA3 | Adenosine A3 receptor (A3AR)
Type:
G Protein-Coupled Receptor (GPCR)
Mol. Mass.:
36197.32
Organism:
Homo sapiens (Human)
Description:
P0DMS8
Residue:
318
  
Inhibitor
Name:
BDBM50170823
Synonyms:
CHEMBL366216 | N*6*-Cyclohexyl-N*2*-(4-dimethylamino-phenyl)-9H-purine-2,6-diamine
Type:
Small organic molecule
Emp. Form.:
C19H25N7
Mol. Mass.:
351.4487
SMILES:
CN(C)c1ccc(Nc2nc(NC3CCCCC3)c3[nH]cnc3n2)cc1
: