Target
Adenosine receptor A2a
Ligand
BDBM50170821
Substrate
Meas. Tech.
ChEMBL_303486 (CHEMBL838860)
Ki
46000±n/a nM
Citation
 Perreira, MJiang, JKKlutz, AMGao, ZGShainberg, ALu, CThomas, CJJacobson, KA "Reversine" and its 2-substituted adenine derivatives as potent and selective A3 adenosine receptor antagonists. J Med Chem 48:4910-8 (2005)  
Target
Name:
Adenosine receptor A2a
Synonyms:
A2A adenosine receptor (hA2A) ADENOSINE A2 ADORA2 Adenosine A2A receptor (A2AAR)
Type:
G Protein-Coupled Receptor (GPCR)
Mol. Mass.:
44716.46
Organism:
Homo sapiens (Human)
Description:
P29274
Residue:
412
  
Inhibitor
Name:
BDBM50170821
Synonyms:
CHEMBL365026 | N*6*-Cyclooctyl-N*2*-phenyl-9H-purine-2,6-diamine
Type:
Small organic molecule
Emp. Form.:
C19H24N6
Mol. Mass.:
336.4341
SMILES:
C1CCCC(CCC1)Nc1nc(Nc2ccccc2)nc2nc[nH]c12
: