Target
Adenosine receptor A3
Ligand
BDBM50170834
Substrate
Meas. Tech.
ChEMBL_303319 (CHEMBL840044)
Ki
1870±n/a nM
Citation
 Perreira, MJiang, JKKlutz, AMGao, ZGShainberg, ALu, CThomas, CJJacobson, KA "Reversine" and its 2-substituted adenine derivatives as potent and selective A3 adenosine receptor antagonists. J Med Chem 48:4910-8 (2005)  
Target
Name:
Adenosine receptor A3
Synonyms:
A3 adenosine receptor (hA3) ADORA3 | Adenosine A3 receptor (A3AR)
Type:
G Protein-Coupled Receptor (GPCR)
Mol. Mass.:
36197.32
Organism:
Homo sapiens (Human)
Description:
P0DMS8
Residue:
318
  
Inhibitor
Name:
BDBM50170834
Synonyms:
CHEMBL364948 | N*6*-Cyclopropyl-N*2*-(4-morpholin-4-yl-phenyl)-9H-purine-2,6-diamine
Type:
Small organic molecule
Emp. Form.:
C18H21N7O
Mol. Mass.:
351.4056
SMILES:
C1CC1Nc1nc(Nc2ccc(cc2)N2CCOCC2)nc2nc[nH]c12
: