Target
Lysophosphatidic acid receptor 1
Ligand
BDBM50170844
Substrate
Meas. Tech.
ChEMBL_310430 (CHEMBL834056)
EC50
193±n/a nM
Citation
 Durgam, GGVirag, TWalker, MDTsukahara, RYasuda, SLiliom, Kvan Meeteren, LAMoolenaar, WHWilke, NSiess, WTigyi, GMiller, DD Synthesis, structure-activity relationships, and biological evaluation of fatty alcohol phosphates as lysophosphatidic acid receptor ligands, activators of PPARgamma, and inhibitors of autotaxin. J Med Chem 48:4919-30 (2005)  
Target
Name:
Lysophosphatidic acid receptor 1
Synonyms:
EDG2 LPA-1 LPAR1 Lysophosphatidic acid receptor 1 (LPA1) | Lysophosphatidic acid receptor Edg-2
Type:
Enzyme
Mol. Mass.:
41120.55
Organism:
Homo sapiens (Human)
Description:
Q92633
Residue:
364
  
Inhibitor
Name:
BDBM50170844
Synonyms:
CHEMBL187459 | Thiophosphoric acid (E)-octadec-9-enyl ester
Type:
Small organic molecule
Emp. Form.:
C18H37O3PS
Mol. Mass.:
364.523
SMILES:
CCCCCCCC\C=C\CCCCCCCCOP(O)(O)=S
: