Target
Lysophosphatidic acid receptor 2
Ligand
BDBM50170858
Substrate
Meas. Tech.
ChEMBL_310431 (CHEMBL834057)
EC50
717±n/a nM
Citation
 Durgam, GGVirag, TWalker, MDTsukahara, RYasuda, SLiliom, Kvan Meeteren, LAMoolenaar, WHWilke, NSiess, WTigyi, GMiller, DD Synthesis, structure-activity relationships, and biological evaluation of fatty alcohol phosphates as lysophosphatidic acid receptor ligands, activators of PPARgamma, and inhibitors of autotaxin. J Med Chem 48:4919-30 (2005)  
Target
Name:
Lysophosphatidic acid receptor 2
Synonyms:
EDG4 LPA-2 LPAR2 Lysophosphatidic acid receptor 2 | Lysophosphatidic acid receptor Edg-4
Type:
PROTEIN
Mol. Mass.:
39103.44
Organism:
Homo sapiens (Human)
Description:
ChEMBL_1451385
Residue:
351
  
Inhibitor
Name:
BDBM50170858
Synonyms:
CHEMBL190349 | Phosphoric acid mono-((E)-dodec-9-enyl) ester
Type:
Small organic molecule
Emp. Form.:
C12H25O4P
Mol. Mass.:
264.2983
SMILES:
CC\C=C\CCCCCCCCOP(O)(O)=O
: