Target
Lysophosphatidic acid receptor 3
Ligand
BDBM50170848
Substrate
Meas. Tech.
ChEMBL_310432 (CHEMBL834058)
EC50
1600±n/a nM
Citation
 Durgam, GGVirag, TWalker, MDTsukahara, RYasuda, SLiliom, Kvan Meeteren, LAMoolenaar, WHWilke, NSiess, WTigyi, GMiller, DD Synthesis, structure-activity relationships, and biological evaluation of fatty alcohol phosphates as lysophosphatidic acid receptor ligands, activators of PPARgamma, and inhibitors of autotaxin. J Med Chem 48:4919-30 (2005)  
Target
Name:
Lysophosphatidic acid receptor 3
Synonyms:
EDG7 LPAR3 Lysophosphatidic acid receptor 1/3 Lysophosphatidic acid receptor Edg-7
Type:
Enzyme
Mol. Mass.:
40149.72
Organism:
Homo sapiens (Human)
Description:
Q9UBY5
Residue:
353
  
Inhibitor
Name:
BDBM50170848
Synonyms:
2-Hexadecanoylamino-3-phosphonooxy-propionic acid | CHEMBL190328
Type:
Small organic molecule
Emp. Form.:
C19H38NO7P
Mol. Mass.:
423.4813
SMILES:
CCCCCCCCCCCCCCCC(=O)N[C@@H](COP(O)(O)=O)C(O)=O
: