Target
Retinoic acid receptor beta
Ligand
BDBM50170866
Substrate
Meas. Tech.
ChEMBL_304470 (CHEMBL832686)
EC50
5300±n/a nM
Citation
 Cincinelli, RDallavalle, SNannei, RCarella, SDe Zani, DMerlini, LPenco, SGarattini, EGiannini, GPisano, CVesci, LCarminati, PZuco, VZanchi, CZunino, F Synthesis and structure-activity relationships of a new series of retinoid-related biphenyl-4-ylacrylic acids endowed with antiproliferative and proapoptotic activity. J Med Chem 48:4931-46 (2005)  
Target
Name:
Retinoic acid receptor beta
Synonyms:
HAP NR1B2 RAR-beta RARB Retinoic acid receptor RXR-alpha/Retinoic acid receptor beta Retinoid receptor
Type:
PROTEIN
Mol. Mass.:
50498.70
Organism:
Homo sapiens (Human)
Description:
ChEMBL_1458015
Residue:
455
  
Inhibitor
Name:
BDBM50170866
Synonyms:
(E)-3-(3'-Cyclohexylmethyl-4'-hydroxy-biphenyl-4-yl)-acrylic acid | CHEMBL188331
Type:
Small organic molecule
Emp. Form.:
C22H24O3
Mol. Mass.:
336.4242
SMILES:
OC(=O)\C=C\c1ccc(cc1)-c1ccc(O)c(CC2CCCCC2)c1
: