Target
Thromboxane A2 receptor
Ligand
BDBM50171466
Substrate
Meas. Tech.
ChEMBL_303672 (CHEMBL830433)
Ki
3100±n/a nM
Citation
 Ohno, MMiyamoto, MHoshi, KTakeda, TYamada, NOhtake, A Development of dual-acting benzofurans for thromboxane A2 receptor antagonist and prostacyclin receptor agonist: synthesis, structure-activity relationship, and evaluation of benzofuran derivatives. J Med Chem 48:5279-94 (2005)  
Target
Name:
Thromboxane A2 receptor
Synonyms:
Prostanoid TP receptor TBXA2R Thromboxane Thromboxane Beta
Type:
Enyzme
Mol. Mass.:
37445.28
Organism:
Homo sapiens (Human)
Description:
P21731
Residue:
343
  
Inhibitor
Name:
BDBM50171466
Synonyms:
CHEMBL361939 | {3-[2-(2,2-Diphenyl-ethylsulfanyl)-ethyl]-benzofuran-7-yloxy}-acetic acid
Type:
Small organic molecule
Emp. Form.:
C26H24O4S
Mol. Mass.:
432.531
SMILES:
OC(=O)COc1cccc2c(CCSCC(c3ccccc3)c3ccccc3)coc12
: